{"text_format":"1","workbook":"xlsx","n_sheets":3,"sheets":["Options","Out","In"],"not_rendered":{"charts":0,"images":0,"macros":1,"external_links":1,"defined_names":6,"comments":1,"pivot_tables":0},"unopened":[],"bounds":{"document_bytes":16777216,"sheet_cells":100000,"rows_first":2000,"rows_last":500,"rows_between":2000,"halvings":0,"cell_chars":16384,"cell_head_chars":4096},"cells_cut":0,"cells_raw":0,"read":"whole","date_system":"1900"}

{"sheet":"Options","index":0,"n_rows":143,"n_cols":14,"rows_kept":143,"cut":false,"hidden":false,"merged":[[15,4,26,12],[120,4,120,6],[121,4,121,6]]}
[6]
[]
[]
[]
[]
[]
[]
[null,null,"Description  and details of Macro"]
[]
[]
[null,null,"Purpose:",null,"Macro to update vote baseline and COE ceiling numbers on the MTEC Submission workbook"]
[null,null,"Sheets:",null,"Background sheets"]
[null,null,"Applicable to:",null,"MTEC Submission workbook"]
[null,null,"Date of macro:",null,"2020-08-25"]
[null,null,"Effective until:"]
[null,null,"More Information:",null,"This macro will make the following adjustments to the model:\n\n1. Update vote baseline and COE ceiling numbers\n\n\n\nTo make sure that all calculations are updated, do the following:\n\nAfter running the macro on the MTEC Submission workbook, SAVE THE WORKBOOK BEFORE CLOSING!"]
[]
[]
[]
[]
[]
[]
[]
[]
[]
[]
[]
[]
[]
[]
{"$rows_left_out":114}
{"sheet":"Out","index":1,"n_rows":46,"n_cols":12,"rows_kept":46,"cut":false,"hidden":true,"merged":[]}
[]
[]
[null,null,"Departmental",{"$f":"SUM(D5:D46)","v":1725821804},1779927618,1809173684,null,null,"Compensation",{"$f":"SUM(J5:J46)","v":174074489},173550534,170610698]
[null,null,"Department","2021/22 Ceiling","2022/23 Ceiling","2023/24 Ceiling",null,null,"Department","2021/22 Ceiling","2022/23 Ceiling","2023/24 Ceiling"]
[null,null,"Agriculture, Land Reform and Rural Development",{"$f":"INDEX((In!H$3:H$44),MATCH(Out!$C5,In!$A$3:$A$44,0))","v":16462194},{"$f":"INDEX((In!I$3:I$44),MATCH(Out!$C5,In!$A$3:$A$44,0))","v":16388334},{"$f":"INDEX((In!J$3:J$44),MATCH(Out!$C5,In!$A$3:$A$44,0))","v":16403340},null,null,"Agriculture, Land Reform and Rural Development",{"$f":"INDEX((In!E$3:E$44),MATCH(Out!$I5,In!$A$3:$A$44,0))","v":4099498},{"$f":"INDEX((In!F$3:F$44),MATCH(Out!$I5,In!$A$3:$A$44,0))","v":4089644},{"$f":"INDEX((In!G$3:G$44),MATCH(Out!$I5,In!$A$3:$A$44,0))","v":4020368}]
[null,null,"Basic Education",{"$f":"INDEX((In!H$3:H$44),MATCH(Out!$C6,In!$A$3:$A$44,0))","v":25724561},{"$f":"INDEX((In!I$3:I$44),MATCH(Out!$C6,In!$A$3:$A$44,0))","v":26089272},{"$f":"INDEX((In!J$3:J$44),MATCH(Out!$C6,In!$A$3:$A$44,0))","v":26097727},null,null,"Basic Education",{"$f":"INDEX((In!E$3:E$44),MATCH(Out!$I6,In!$A$3:$A$44,0))","v":541405},{"$f":"INDEX((In!F$3:F$44),MATCH(Out!$I6,In!$A$3:$A$44,0))","v":540000},{"$f":"INDEX((In!G$3:G$44),MATCH(Out!$I6,In!$A$3:$A$44,0))","v":530853}]
[null,null,"Civilian Secretariat for the Police Service",{"$f":"INDEX((In!H$3:H$44),MATCH(Out!$C7,In!$A$3:$A$44,0))","v":148175},{"$f":"INDEX((In!I$3:I$44),MATCH(Out!$C7,In!$A$3:$A$44,0))","v":148221},{"$f":"INDEX((In!J$3:J$44),MATCH(Out!$C7,In!$A$3:$A$44,0))","v":148526},null,null,"Civilian Secretariat for the Police Service",{"$f":"INDEX((In!E$3:E$44),MATCH(Out!$I7,In!$A$3:$A$44,0))","v":103839},{"$f":"INDEX((In!F$3:F$44),MATCH(Out!$I7,In!$A$3:$A$44,0))","v":103564},{"$f":"INDEX((In!G$3:G$44),MATCH(Out!$I7,In!$A$3:$A$44,0))","v":101809}]
[null,null,"Communications and Digital Technologies",{"$f":"INDEX((In!H$3:H$44),MATCH(Out!$C8,In!$A$3:$A$44,0))","v":3593755},{"$f":"INDEX((In!I$3:I$44),MATCH(Out!$C8,In!$A$3:$A$44,0))","v":2317686},{"$f":"INDEX((In!J$3:J$44),MATCH(Out!$C8,In!$A$3:$A$44,0))","v":2319121},null,null,"Communications and Digital Technologies",{"$f":"INDEX((In!E$3:E$44),MATCH(Out!$I8,In!$A$3:$A$44,0))","v":322804},{"$f":"INDEX((In!F$3:F$44),MATCH(Out!$I8,In!$A$3:$A$44,0))","v":321757},{"$f":"INDEX((In!G$3:G$44),MATCH(Out!$I8,In!$A$3:$A$44,0))","v":316307}]
[null,null,"Cooperative Governance",{"$f":"INDEX((In!H$3:H$44),MATCH(Out!$C9,In!$A$3:$A$44,0))","v":98283081},{"$f":"INDEX((In!I$3:I$44),MATCH(Out!$C9,In!$A$3:$A$44,0))","v":102073783},{"$f":"INDEX((In!J$3:J$44),MATCH(Out!$C9,In!$A$3:$A$44,0))","v":102102360},null,null,"Cooperative Governance",{"$f":"INDEX((In!E$3:E$44),MATCH(Out!$I9,In!$A$3:$A$44,0))","v":366155},{"$f":"INDEX((In!F$3:F$44),MATCH(Out!$I9,In!$A$3:$A$44,0))","v":365032},{"$f":"INDEX((In!G$3:G$44),MATCH(Out!$I9,In!$A$3:$A$44,0))","v":358848}]
[null,null,"Correctional Services",{"$f":"INDEX((In!H$3:H$44),MATCH(Out!$C10,In!$A$3:$A$44,0))","v":25481767},{"$f":"INDEX((In!I$3:I$44),MATCH(Out!$C10,In!$A$3:$A$44,0))","v":25508962},{"$f":"INDEX((In!J$3:J$44),MATCH(Out!$C10,In!$A$3:$A$44,0))","v":25559215},null,null,"Correctional Services",{"$f":"INDEX((In!E$3:E$44),MATCH(Out!$I10,In!$A$3:$A$44,0))","v":17428197},{"$f":"INDEX((In!F$3:F$44),MATCH(Out!$I10,In!$A$3:$A$44,0))","v":17369347},{"$f":"INDEX((In!G$3:G$44),MATCH(Out!$I10,In!$A$3:$A$44,0))","v":17075121}]
[null,null,"Defence",{"$f":"INDEX((In!H$3:H$44),MATCH(Out!$C11,In!$A$3:$A$44,0))","v":45398357},{"$f":"INDEX((In!I$3:I$44),MATCH(Out!$C11,In!$A$3:$A$44,0))","v":45428731},{"$f":"INDEX((In!J$3:J$44),MATCH(Out!$C11,In!$A$3:$A$44,0))","v":45515030},null,null,"Defence",{"$f":"INDEX((In!E$3:E$44),MATCH(Out!$I11,In!$A$3:$A$44,0))","v":28894120},{"$f":"INDEX((In!F$3:F$44),MATCH(Out!$I11,In!$A$3:$A$44,0))","v":28819486},{"$f":"INDEX((In!G$3:G$44),MATCH(Out!$I11,In!$A$3:$A$44,0))","v":28331302}]
[null,null,"Employment and Labour",{"$f":"INDEX((In!H$3:H$44),MATCH(Out!$C12,In!$A$3:$A$44,0))","v":3441125},{"$f":"INDEX((In!I$3:I$44),MATCH(Out!$C12,In!$A$3:$A$44,0))","v":3435356},{"$f":"INDEX((In!J$3:J$44),MATCH(Out!$C12,In!$A$3:$A$44,0))","v":3439828},null,null,"Employment and Labour",{"$f":"INDEX((In!E$3:E$44),MATCH(Out!$I12,In!$A$3:$A$44,0))","v":1382667},{"$f":"INDEX((In!F$3:F$44),MATCH(Out!$I12,In!$A$3:$A$44,0))","v":1379094},{"$f":"INDEX((In!G$3:G$44),MATCH(Out!$I12,In!$A$3:$A$44,0))","v":1355733}]
[null,null,"Environment, Forestry and Fisheries",{"$f":"INDEX((In!H$3:H$44),MATCH(Out!$C13,In!$A$3:$A$44,0))","v":8462278},{"$f":"INDEX((In!I$3:I$44),MATCH(Out!$C13,In!$A$3:$A$44,0))","v":8460777},{"$f":"INDEX((In!J$3:J$44),MATCH(Out!$C13,In!$A$3:$A$44,0))","v":8467911},null,null,"Environment, Forestry and Fisheries",{"$f":"INDEX((In!E$3:E$44),MATCH(Out!$I13,In!$A$3:$A$44,0))","v":1909148},{"$f":"INDEX((In!F$3:F$44),MATCH(Out!$I13,In!$A$3:$A$44,0))","v":1903696},{"$f":"INDEX((In!G$3:G$44),MATCH(Out!$I13,In!$A$3:$A$44,0))","v":1871449}]
[null,null,"Government Communication and Information System",{"$f":"INDEX((In!H$3:H$44),MATCH(Out!$C14,In!$A$3:$A$44,0))","v":684316},{"$f":"INDEX((In!I$3:I$44),MATCH(Out!$C14,In!$A$3:$A$44,0))","v":683551},{"$f":"INDEX((In!J$3:J$44),MATCH(Out!$C14,In!$A$3:$A$44,0))","v":684457},null,null,"Government Communication and Information System",{"$f":"INDEX((In!E$3:E$44),MATCH(Out!$I14,In!$A$3:$A$44,0))","v":273728},{"$f":"INDEX((In!F$3:F$44),MATCH(Out!$I14,In!$A$3:$A$44,0))","v":273238},{"$f":"INDEX((In!G$3:G$44),MATCH(Out!$I14,In!$A$3:$A$44,0))","v":268609}]
[null,null,"Health",{"$f":"INDEX((In!H$3:H$44),MATCH(Out!$C15,In!$A$3:$A$44,0))","v":56960689},{"$f":"INDEX((In!I$3:I$44),MATCH(Out!$C15,In!$A$3:$A$44,0))","v":57801682},{"$f":"INDEX((In!J$3:J$44),MATCH(Out!$C15,In!$A$3:$A$44,0))","v":57818762},null,null,"Health",{"$f":"INDEX((In!E$3:E$44),MATCH(Out!$I15,In!$A$3:$A$44,0))","v":834283},{"$f":"INDEX((In!F$3:F$44),MATCH(Out!$I15,In!$A$3:$A$44,0))","v":824411},{"$f":"INDEX((In!G$3:G$44),MATCH(Out!$I15,In!$A$3:$A$44,0))","v":810446}]
[null,null,"Higher Education and Training",{"$f":"INDEX((In!H$3:H$44),MATCH(Out!$C16,In!$A$3:$A$44,0))","v":113769400},{"$f":"INDEX((In!I$3:I$44),MATCH(Out!$C16,In!$A$3:$A$44,0))","v":115264244},{"$f":"INDEX((In!J$3:J$44),MATCH(Out!$C16,In!$A$3:$A$44,0))","v":115319849},null,null,"Higher Education and Training",{"$f":"INDEX((In!E$3:E$44),MATCH(Out!$I16,In!$A$3:$A$44,0))","v":9527912},{"$f":"INDEX((In!F$3:F$44),MATCH(Out!$I16,In!$A$3:$A$44,0))","v":9503041},{"$f":"INDEX((In!G$3:G$44),MATCH(Out!$I16,In!$A$3:$A$44,0))","v":9342066}]
[null,null,"Home Affairs",{"$f":"INDEX((In!H$3:H$44),MATCH(Out!$C17,In!$A$3:$A$44,0))","v":8686084},{"$f":"INDEX((In!I$3:I$44),MATCH(Out!$C17,In!$A$3:$A$44,0))","v":8701973},{"$f":"INDEX((In!J$3:J$44),MATCH(Out!$C17,In!$A$3:$A$44,0))","v":8710229},null,null,"Home Affairs",{"$f":"INDEX((In!E$3:E$44),MATCH(Out!$I17,In!$A$3:$A$44,0))","v":3592336},{"$f":"INDEX((In!F$3:F$44),MATCH(Out!$I17,In!$A$3:$A$44,0))","v":3547576},{"$f":"INDEX((In!G$3:G$44),MATCH(Out!$I17,In!$A$3:$A$44,0))","v":3487482}]
[null,null,"Human Settlements",{"$f":"INDEX((In!H$3:H$44),MATCH(Out!$C18,In!$A$3:$A$44,0))","v":29917175},{"$f":"INDEX((In!I$3:I$44),MATCH(Out!$C18,In!$A$3:$A$44,0))","v":29917456},{"$f":"INDEX((In!J$3:J$44),MATCH(Out!$C18,In!$A$3:$A$44,0))","v":29926591},null,null,"Human Settlements",{"$f":"INDEX((In!E$3:E$44),MATCH(Out!$I18,In!$A$3:$A$44,0))","v":401740},{"$f":"INDEX((In!F$3:F$44),MATCH(Out!$I18,In!$A$3:$A$44,0))","v":400697},{"$f":"INDEX((In!G$3:G$44),MATCH(Out!$I18,In!$A$3:$A$44,0))","v":393910}]
[null,null,"Independent Police Investigative Directorate",{"$f":"INDEX((In!H$3:H$44),MATCH(Out!$C19,In!$A$3:$A$44,0))","v":337108},{"$f":"INDEX((In!I$3:I$44),MATCH(Out!$C19,In!$A$3:$A$44,0))","v":337241},{"$f":"INDEX((In!J$3:J$44),MATCH(Out!$C19,In!$A$3:$A$44,0))","v":337906},null,null,"Independent Police Investigative Directorate",{"$f":"INDEX((In!E$3:E$44),MATCH(Out!$I19,In!$A$3:$A$44,0))","v":224816},{"$f":"INDEX((In!F$3:F$44),MATCH(Out!$I19,In!$A$3:$A$44,0))","v":224215},{"$f":"INDEX((In!G$3:G$44),MATCH(Out!$I19,In!$A$3:$A$44,0))","v":220417}]
[null,null,"International Relations and Cooperation",{"$f":"INDEX((In!H$3:H$44),MATCH(Out!$C20,In!$A$3:$A$44,0))","v":6395681},{"$f":"INDEX((In!I$3:I$44),MATCH(Out!$C20,In!$A$3:$A$44,0))","v":6416928},{"$f":"INDEX((In!J$3:J$44),MATCH(Out!$C20,In!$A$3:$A$44,0))","v":6425953},null,null,"International Relations and Cooperation",{"$f":"INDEX((In!E$3:E$44),MATCH(Out!$I20,In!$A$3:$A$44,0))","v":2841965},{"$f":"INDEX((In!F$3:F$44),MATCH(Out!$I20,In!$A$3:$A$44,0))","v":2834719},{"$f":"INDEX((In!G$3:G$44),MATCH(Out!$I20,In!$A$3:$A$44,0))","v":2786701}]
[null,null,"Justice and Constitutional Development",{"$f":"INDEX((In!H$3:H$44),MATCH(Out!$C21,In!$A$3:$A$44,0))","v":21195789},{"$f":"INDEX((In!I$3:I$44),MATCH(Out!$C21,In!$A$3:$A$44,0))","v":21189453},{"$f":"INDEX((In!J$3:J$44),MATCH(Out!$C21,In!$A$3:$A$44,0))","v":21225975},null,null,"Justice and Constitutional Development",{"$f":"INDEX((In!E$3:E$44),MATCH(Out!$I21,In!$A$3:$A$44,0))","v":11990486},{"$f":"INDEX((In!F$3:F$44),MATCH(Out!$I21,In!$A$3:$A$44,0))","v":11960325},{"$f":"INDEX((In!G$3:G$44),MATCH(Out!$I21,In!$A$3:$A$44,0))","v":11757725}]
[null,null,"Military Veterans",{"$f":"INDEX((In!H$3:H$44),MATCH(Out!$C22,In!$A$3:$A$44,0))","v":656108},{"$f":"INDEX((In!I$3:I$44),MATCH(Out!$C22,In!$A$3:$A$44,0))","v":655760},{"$f":"INDEX((In!J$3:J$44),MATCH(Out!$C22,In!$A$3:$A$44,0))","v":656254},null,null,"Military Veterans",{"$f":"INDEX((In!E$3:E$44),MATCH(Out!$I22,In!$A$3:$A$44,0))","v":126686},{"$f":"INDEX((In!F$3:F$44),MATCH(Out!$I22,In!$A$3:$A$44,0))","v":126273},{"$f":"INDEX((In!G$3:G$44),MATCH(Out!$I22,In!$A$3:$A$44,0))","v":124134}]
[null,null,"Mineral Resources and Energy",{"$f":"INDEX((In!H$3:H$44),MATCH(Out!$C23,In!$A$3:$A$44,0))","v":8734317},{"$f":"INDEX((In!I$3:I$44),MATCH(Out!$C23,In!$A$3:$A$44,0))","v":9331524},{"$f":"INDEX((In!J$3:J$44),MATCH(Out!$C23,In!$A$3:$A$44,0))","v":9336705},null,null,"Mineral Resources and Energy",{"$f":"INDEX((In!E$3:E$44),MATCH(Out!$I23,In!$A$3:$A$44,0))","v":1036210},{"$f":"INDEX((In!F$3:F$44),MATCH(Out!$I23,In!$A$3:$A$44,0))","v":1033526},{"$f":"INDEX((In!G$3:G$44),MATCH(Out!$I23,In!$A$3:$A$44,0))","v":1016019}]
[null,null,"National School of Government",{"$f":"INDEX((In!H$3:H$44),MATCH(Out!$C24,In!$A$3:$A$44,0))","v":197517},{"$f":"INDEX((In!I$3:I$44),MATCH(Out!$C24,In!$A$3:$A$44,0))","v":195917},{"$f":"INDEX((In!J$3:J$44),MATCH(Out!$C24,In!$A$3:$A$44,0))","v":196117},null,null,"National School of Government",{"$f":"INDEX((In!E$3:E$44),MATCH(Out!$I24,In!$A$3:$A$44,0))","v":57849},{"$f":"INDEX((In!F$3:F$44),MATCH(Out!$I24,In!$A$3:$A$44,0))","v":57700},{"$f":"INDEX((In!G$3:G$44),MATCH(Out!$I24,In!$A$3:$A$44,0))","v":56722}]
[null,null,"National Treasury",{"$f":"INDEX((In!H$3:H$44),MATCH(Out!$C25,In!$A$3:$A$44,0))","v":819770422},{"$f":"INDEX((In!I$3:I$44),MATCH(Out!$C25,In!$A$3:$A$44,0))","v":862537484},{"$f":"INDEX((In!J$3:J$44),MATCH(Out!$C25,In!$A$3:$A$44,0))","v":891106216},null,null,"National Treasury",{"$f":"INDEX((In!E$3:E$44),MATCH(Out!$I25,In!$A$3:$A$44,0))","v":860894},{"$f":"INDEX((In!F$3:F$44),MATCH(Out!$I25,In!$A$3:$A$44,0))","v":858670},{"$f":"INDEX((In!G$3:G$44),MATCH(Out!$I25,In!$A$3:$A$44,0))","v":844125}]
[null,null,"Not defined",{"$f":"INDEX((In!H$3:H$44),MATCH(Out!$C26,In!$A$3:$A$44,0))","v":3773184},{"$f":"INDEX((In!I$3:I$44),MATCH(Out!$C26,In!$A$3:$A$44,0))","v":5489386},{"$f":"INDEX((In!J$3:J$44),MATCH(Out!$C26,In!$A$3:$A$44,0))","v":5490874},null,null,"Not defined",{"$f":"INDEX((In!E$3:E$44),MATCH(Out!$I26,In!$A$3:$A$44,0))","v":0},{"$f":"INDEX((In!F$3:F$44),MATCH(Out!$I26,In!$A$3:$A$44,0))","v":0},{"$f":"INDEX((In!G$3:G$44),MATCH(Out!$I26,In!$A$3:$A$44,0))","v":0}]
[null,null,"Office of the Chief Justice",{"$f":"INDEX((In!H$3:H$44),MATCH(Out!$C27,In!$A$3:$A$44,0))","v":2309481},{"$f":"INDEX((In!I$3:I$44),MATCH(Out!$C27,In!$A$3:$A$44,0))","v":2311114},{"$f":"INDEX((In!J$3:J$44),MATCH(Out!$C27,In!$A$3:$A$44,0))","v":2316289},null,null,"Office of the Chief Justice",{"$f":"INDEX((In!E$3:E$44),MATCH(Out!$I27,In!$A$3:$A$44,0))","v":1733123},{"$f":"INDEX((In!F$3:F$44),MATCH(Out!$I27,In!$A$3:$A$44,0))","v":1729844},{"$f":"INDEX((In!G$3:G$44),MATCH(Out!$I27,In!$A$3:$A$44,0))","v":1700541}]
[null,null,"Parliament",{"$f":"INDEX((In!H$3:H$44),MATCH(Out!$C28,In!$A$3:$A$44,0))","v":2592502},{"$f":"INDEX((In!I$3:I$44),MATCH(Out!$C28,In!$A$3:$A$44,0))","v":2597039},{"$f":"INDEX((In!J$3:J$44),MATCH(Out!$C28,In!$A$3:$A$44,0))","v":2601314},null,null,"Parliament",{"$f":"INDEX((In!E$3:E$44),MATCH(Out!$I28,In!$A$3:$A$44,0))","v":1394928},{"$f":"INDEX((In!F$3:F$44),MATCH(Out!$I28,In!$A$3:$A$44,0))","v":1391314},{"$f":"INDEX((In!G$3:G$44),MATCH(Out!$I28,In!$A$3:$A$44,0))","v":1367746}]
[null,null,"Planning, Monitoring and Evaluation",{"$f":"INDEX((In!H$3:H$44),MATCH(Out!$C29,In!$A$3:$A$44,0))","v":468357},{"$f":"INDEX((In!I$3:I$44),MATCH(Out!$C29,In!$A$3:$A$44,0))","v":470219},{"$f":"INDEX((In!J$3:J$44),MATCH(Out!$C29,In!$A$3:$A$44,0))","v":471120},null,null,"Planning, Monitoring and Evaluation",{"$f":"INDEX((In!E$3:E$44),MATCH(Out!$I29,In!$A$3:$A$44,0))","v":312014},{"$f":"INDEX((In!F$3:F$44),MATCH(Out!$I29,In!$A$3:$A$44,0))","v":310934},{"$f":"INDEX((In!G$3:G$44),MATCH(Out!$I29,In!$A$3:$A$44,0))","v":305667}]
[null,null,"Police",{"$f":"INDEX((In!H$3:H$44),MATCH(Out!$C30,In!$A$3:$A$44,0))","v":95748377},{"$f":"INDEX((In!I$3:I$44),MATCH(Out!$C30,In!$A$3:$A$44,0))","v":95589536},{"$f":"INDEX((In!J$3:J$44),MATCH(Out!$C30,In!$A$3:$A$44,0))","v":95800041},null,null,"Police",{"$f":"INDEX((In!E$3:E$44),MATCH(Out!$I30,In!$A$3:$A$44,0))","v":75285882},{"$f":"INDEX((In!F$3:F$44),MATCH(Out!$I30,In!$A$3:$A$44,0))","v":75088075},{"$f":"INDEX((In!G$3:G$44),MATCH(Out!$I30,In!$A$3:$A$44,0))","v":73816132}]
{"$rows_left_out":17}
{"sheet":"In","index":2,"n_rows":95,"n_cols":14,"rows_kept":95,"cut":false,"hidden":true,"merged":[]}
[null,"Hennie","Hennie","Hennie","Donald","Donald","Donald","Total","Total","Total"]
["Excl Interest and Contingency","2021/22 Non-CoE","2022/23 Non-CoE","2023/24 Non-CoE","2021/22 CoE","2022/23 CoE","2023/24 CoE","2021/22","2022/23","2023/24"]
["Agriculture, Land Reform and Rural Development",{"$f":"ROUND(L3,0)","v":12362696},{"$f":"ROUND(M3,0)","v":12298690},12382972,{"$f":"IFERROR(INDEX((C$55:C$95),MATCH($A3,$B$55:$B$95,0)),0)","v":4099498},4089644,4020368,{"$f":"SUM(B3,E3)","v":16462194},16388334,16403340,null,12362695.699216759,12298689.842983536,12382972.349744037]
["Basic Education",{"$f":"ROUND(L4,0)","v":25183156},{"$f":"ROUND(M4,0)","v":25549272},{"$f":"ROUND(N4,0)","v":25566874},541405,540000,530853,25724561,26089272,26097727,null,25183155.97380488,25549272.162258759,25566874.021823157]
["Civilian Secretariat for the Police Service",44336,44657,46717,103839,103564,101809,148175,148221,148526,null,44335.84984689024,44657.074039772058,46716.739844261829]
["Communications and Digital Technologies",3270951,1995929,2002814,322804,321757,316307,3593755,2317686,2319121,null,3270950.51359034,1995928.8545658044,2002814.0504284953]
["Cooperative Governance",97916926,101708751,101743512,366155,365032,358848,98283081,102073783,102102360,null,97916925.54438369,101708751.2018328,101743512.1506934]
["Correctional Services",8053570,8139615,8484094,17428197,17369347,17075121,25481767,25508962,25559215,null,8053569.7230058089,8139614.7210504599,8484094.1856605113]
["Defence",16504237,16609245,17183728,28894120,28819486,28331302,45398357,45428731,45515030,null,16504237.037520448,16609245.231278172,17183728.434171319]
["Employment and Labour",2058458,2056262,2084095,1382667,1379094,1355733,3441125,3435356,3439828,null,2058457.6217774188,2056262.3479024023,2084094.624228345]
["Environment, Forestry and Fisheries",6553130,6557081,6596462,1909148,1903696,1871449,8462278,8460777,8467911,null,6553129.6463959068,6557081.3103726115,6596461.56203839]
["Government Communication and Information System",410588,410313,415848,273728,273238,268609,684316,683551,684457,null,410588.47666851047,410312.70994857495,415847.50753547129]
["Health",56126406,56977271,57008316,834283,824411,810446,56960689,57801682,57818762,null,56126406.322574548,56977271.376352884,57008315.821010932]
["Higher Education and Training",104241488,105761203,105977783,9527912,9503041,9342066,113769400,115264244,115319849,null,104241488.47817175,105761203.29575339,105977783.49682792]
["Home Affairs",5093748,5154397,5222747,3592336,3547576,3487482,8686084,8701973,8710229,null,5093747.9811553098,5154397.2526362287,5222746.569228461]
["Human Settlements",29515435,29516759,29532681,401740,400697,393910,29917175,29917456,29926591,null,29515434.980063092,29516759.285698652,29532681.152510036]
["Independent Police Investigative Directorate",112292,113026,117489,224816,224215,220417,337108,337241,337906,null,112291.82863074208,113025.55304745652,117488.80357396134]
["International Relations and Cooperation",3553716,3582209,3639252,2841965,2834719,2786701,6395681,6416928,6425953,null,3553716.3158695237,3582208.9454591037,3639252.3844781574]
["Justice and Constitutional Development",9205303,9229128,9468250,11990486,11960325,11757725,21195789,21189453,21225975,null,9205302.5354545806,9229128.327753583,9468249.9219126888]
["Military Veterans",529422,529487,532120,126686,126273,124134,656108,655760,656254,null,529421.98504324607,529487.00851659756,532120.06265264307]
["Mineral Resources and Energy",7698107,8297998,8320686,1036210,1033526,1016019,8734317,9331524,9336705,null,7698106.6507450985,8297997.7858137926,8320686.2119929483]
["National School of Government",139668,138217,139395,57849,57700,56722,197517,195917,196117,null,139668.47908251299,138216.54513290923,139395.21041312566]
["National Treasury",818909528,861678814,890262091,860894,858670,844125,819770422,862537484,891106216,null,818909527.74130785,861678813.57520199,890262090.72024775]
["Not defined",3773184,5489386,5490874,0,0,0,3773184,5489386,5490874,null,3773183.5362558449,5489386.4956389414,5490873.8183255224]
["Office of the Chief Justice",576358,581270,615748,1733123,1729844,1700541,2309481,2311114,2316289,null,576357.55834661657,581270.22112545813,615748.38969166833]
["Parliament",1197574,1205725,1233568,1394928,1391314,1367746,2592502,2597039,2601314,null,1197574.4957557789,1205725.445812108,1233568.0571471034]
["Planning, Monitoring and Evaluation",156343,159285,165453,312014,310934,305667,468357,470219,471120,null,156342.803120645,159284.61304620586,165452.57759531314]
["Police",20462495,20501461,21983909,75285882,75088075,73816132,95748377,95589536,95800041,null,20462495.01644345,20501460.597450554,21983909.240804806]
["Public Enterprises",4176408,1738346,1742421,182685,182212,179125,4359093,1920558,1921546,null,4176407.624745477,1738345.9791199639,1742420.5551943239]
["Public Service and Administration",231989,229700,236029,311983,312197,306909,543972,541897,542938,null,231989.4732472703,229699.71831901441,236028.80421863042]
{"$rows_left_out":65}